Jump to content

Sleep

Members
  • Content Count

    7
  • Joined

  • Last visited

    Never

About Sleep

  • Rank
    Newbie

Profile Information

  • Location
    Московская область
  1. Проблема решилась игрой с параметрами. И заменой 64 на 32 битную платформу. Спасибо за комментарии. Да, кстати, Ubuntu Studio - тоже вариант, только мне так и не удалось запустить Ardour ни на Мандриве, ни на убунте... (так как целью ставилась запись звука близкая к студийной)
  2. Народ, проблема с JACK. При запуске из консоли вылетает следующим образом $ jackd -R -dalsa -dhw:0 -r48000 -p1024 -n2 jackd 0.107.7 Copyright 2001-2005 Paul Davis and others. jackd comes with ABSOLUTELY NO WARRANTY This is free software, and you are welcome to redistribute it under certain conditions; see the file COPYING for details JACK compiled with System V SHM support. cannot use real-time scheduling (FIFO at priority 10) [for thread 121303920, from thread 121303920] (1: Operation not permitted) cannot create engine я так понимаю, проблема кроется в последних строках, но как ее исправить даже мыслей нет....
  3. Желание собрать есть, и сильное... Т.к. мне кажется, что aMule нада библиотеку из этого пакета. Но боюсь не смогу корректно общаться с разработчиками... т.к. в английском не особо то и шарю... Буду пытаться...
  4. Гений, блин!!! Еслиб я втыкнул в чем там ошибка, то не писал бы пост. Если ты такой умный, то объясни в чем дело. Не можешь- не флуди...
  5. Собирал wxX11-2.6.3 make вылетела следующим образом: In file included from include/wx/window.h:1361, from include/wx/app.h:23, from src/common/event.cpp:40: /usr/include/wx/gtk/window.h:158: error: syntax error before `*' token /usr/include/wx/gtk/window.h:210: error: syntax error before `*' token /usr/include/wx/gtk/window.h:254: error: syntax error before `*' token In file included from include/wx/frame.h:255, from /usr/include/wx/gtk/app.h:17, from include/wx/app.h:570, from src/common/event.cpp:40: /usr/include/wx/gtk/frame.h:71: error: `wxTB_HORIZONTAL' was not declared in this scope /usr/include/wx/gtk/frame.h:71: error: `wxTB_FLAT' was not declared in this scope In file included from include/wx/app.h:570, from src/common/event.cpp:40: /usr/include/wx/gtk/app.h:48: error: conflicting return type specified for ` virtual void wxApp::Dispatch()' include/wx/app.h:409: error: overriding `virtual bool wxAppBase::Dispatch()' /usr/include/wx/gtk/app.h:59: error: `static void wxApp::CleanUp()' cannot be declared include/wx/app.h:374: error: since `virtual void wxAppBase::CleanUp()' declared in base class make: *** [coredll_event.o] Ошибка 1 Народ! Где грабли?
×
×
  • Create New...